Error C3861 Identifier Not Found Msdn

RECOMMENDED: If you have Windows errors then we strongly recommend that you download and run this (Windows) Repair Tool.

[Coding] Ayyware debugin error "_ReturnAddress" – UnKnoWnCheaTs – Ayyware debugin error "_ReturnAddress" – Counterstrike Global Offensive Hacks and Cheats. C3861 "_ReturnAddress" identifier not found

This is my first time and I'd like to make a parallel process using the windows CreateProcess function. Based on the example at MSDN I created a LPTSTR "(non-const.

The compiler was not able to resolve a reference to an identifier, even using argument-dependent lookup.

Feb 28, 2012. When i try to include Eigen this happens: 1>e:program files (x86)microsoft visual studio 10.0vcincludeeigensrc/Core/util/Memory.h(756):.

DllMain’ : function cannot be overloaded c:Documents and SettingsmikaelMy DocumentsVisual Studio 2005ProjectsXercesLibXercesLibutilMsgLoadersWin32Win32MsgLoader.cpp 38 Error 2 error C3861:.

I’m running across some odd errors when rebuilding modules that I haven’t seen before. the following errors happen when I get to sivb.cpp.sivb.cpp(668) : error C3861: ‘DelMesh’: identifier not found.sivb.cpp(669) : error C3861:.

i am running a program on win 7 via visual studio 2008 and i am getting this error: Error 4 error C3861: ‘snprintf’: identifier not found i have included stdio.

Error 50.2 Fuser Error Message Radio-error = 512 Radio Log N166DA.pdf. Account Suspended – This Account has been suspended. The 2016 Chevrolet Cruze Limited compact sedan is a placeholder, a renamed 2015 model that’s offered in lieu of the all-new but late-arriving 2016 Cruze. So what’s it got to offer, and what does the competition look like? Can the 2016.

I don’t understand the error: ": error C3861: ‘getSalary’: identifier not found" double Salary::getSalary() { return salary; } void Salary::compute() { cout << "Enter the employee’s paycode (-1 to end): "; cin >> paycode;.

Apr 26, 2010. error C2589: '(' : illegal token on right side of '::'. Define the NOMINMAX macro to instruct WinDef.h not to define the min/max macros. E.g. you.

If no error occurs, InetNtop function returns a pointer to a buffer containing the string. http://msdn.microsoft.com/en-us/library/aa383745.aspx. was found in the database, but it does not have the correct associated data being resolved for.

The following is signature, not part of post Please mark the post answered your question as the answer, and mark other helpful posts as helpful, so they.

error C3861: ‘mclWrite’: identifier not found 1>c:documents and settingsadminmy documentsvisual studio 2005projectsoglforcesensoroglforcesensorchebylib.cpp(69) : error C3861: ‘mclWrite’: identifier not found.

Feb 11, 2012. Did you find any solution ?. I suggest that you should not define __CUDACC__ in your code all the time. Instead, do. https://blogs.msdn.microsoft.com/vcblog/ 2011/03/29/troubleshooting-tips-for-intellisense-slowness/.

Jul 11, 2017  · C++ tutorials, C and C++ news, and information about the C++ IDE Visual Studio from the Microsoft C++ team.

Error-free Programming In fact, thousands of hours of live and VOD programming is delivered via the open internet. high-quality, reliable, and error-free content delivery. We all. For several months Cook has been intrigued about the prospect of playing a program like UCLA on back-to-back nights. Jazz Sweet had 10 kills on 17. Fix Your Computer Errors with

Jan 11, 2015. Seems it's not required by Caffe though. Boost. A walk around is found here. Change the line used “getpid” in common.cpp to fix POSIX error. and here https://msdn.microsoft.com/en-us/library/cs8hbt1w(v=vs.90).aspx.

CppClr.cpp(5): error C2653: ‘Console’ : is not a class or namespace name CppClr.cpp(5): error C3861: ‘WriteLine’: identifier not found CppClr.cpp(6): error C2653: ‘Console’ : is not a class or namespace name CppClr.cpp(6): error.

Try adding this include to the end of your stdafx.h file. #include <altcecrt.h> I would suggest looking at this document http://msdn.microsoft.com/library/default.asp.

Identifier not found error on function call. error C3861: 'initNode': identifier not found. 1. How can I fix "Overloaded member function not found" error? 0.

RECOMMENDED: Click here to fix Windows errors and improve system performance