Error Error_platform_failure Gallery

RECOMMENDED: If you have Windows errors then we strongly recommend that you download and run this (Windows) Repair Tool.

The Standard Error Of The Sampling Distribution Is Equal To Trillian Aim Unknown Error 18 NightHunter data theft campaign building big data threats – Cyphort – Jul 9, 2014. Fake Error Message. – Capture. Pidgin/Trillian/Paltalk/AIM/IMVU. 18. 2013-05 -31. 2014-06-12. smtp-mail.outlook.com. 1. 2014-05-23. The truth is, TA is useful but news events are unknown and when they happen. Remember I posted 0.22 was an error. Nobody

'Error (ERROR_PLATFORM_FAILURE)' Issues | Gallery – That's also platform related. Try to change the folder permissions recursively.—–Enter the Gallery 2 Theme Contest today!

i think it is Upgradeable Core and Modules: At long last we support upgrading from one version of G2 to the next. Unfortunately, this may not work reliably for all.

Here's the error from G2: Error (ERROR_PLATFORM_FAILURE). in modules/ core/classes/GalleryTemplate.class at line 288 (GalleryCoreApi::error).

`chmod -R 777` might take a while, but it's required, yah. Most FTP clients have a way to automate this, so while it might take a lot of "real" time, you should be.

If the error only occurs when browsing to a specific page / album or when. ERROR_PLATFORM_FAILURE, FAQ: How can I fix the.

Fatal Error Cannot Unset String Offsets In Cck/content.module Fatal error: Cannot unset string offsets in /home/iaald/public_html/sites/all/modules/cck. diff –git a/sites/all/modules/cck/content.module b/sites/all/modules. Just was bitten by this issue. Error: Fatal error: Cannot unset string offsets in /var/www/drupal/sites/all/modules/cck/content.module on line 1248 This fatal error. I created a content type and set the OL WKT to Hidden. Each time I try to create or modify a node,

gallery2 – Error (ERROR_PLATFORM_FAILURE) – openkb.org – Error: Error (ERROR_PLATFORM_FAILURE) * in modules/core/classes/GalleryTemplate.class at line 239 (gallerystatus::error) * in modules/core/classes/GalleryTemplate.

Here's the error that appears when I try to access my gallery. It happened one to the other day. Error Error (ERROR_PLATFORM_FAILURE) :.

Error (ERROR_PLATFORM_FAILURE), DesireeStar, 1, 2 years 32 weeks ago. ORM Validation has failed for items model, wongsiu, 0, 2 years 33 weeks ago.

RECOMMENDED: Click here to fix Windows errors and improve system performance