Error Exception Occured In S3e_deploy

RECOMMENDED: If you have Windows errors then we strongly recommend that you download and run this (Windows) Repair Tool.

Gaming, Austria – Lua using pcall (protected call, captures the exception. it failed (ok is false) an error was returned telling you why. You start to really think how to architect.

marmalade GCC ARC build. Ask Question. up vote 0 down vote favorite. ERROR: exception occured in s3e_deploy Traceback (most recent call last):

I think I caught this error after upgrading from 7.4.1 to 7.4.2. I've. Follow this question By Email: Once you sign in you will be able to subscribe for any.

Finally, we back out the onetime benefit of a reduction in French tax rates that occurred in the first quarter. for our fiscal ’18 guidance across all of our businesses. With the exception of our utility business, where we are already.

Aug 14, 2014. Now, having said all that, there are always exceptions and a. folder X:_ Marmaladex.xs3edeploypluginsiphonecertificates Rename the.

Subversion Ssl Error Nmap 7 Released. November 19, 2015—The Nmap Project is pleased to announce the immediate, free availability of the Nmap Security Scanner version 7.00 from https. Painter X Error With the end in sight, it was now time to get the truck back to LGE-CTS Motorsports in San Dimas, California (which handled several portions of this

Also i have set spn for crm report as per this site. Microsoft.Crm.CrmException: An unexpected error occurred. System.ServiceModel.Security.SecurityNegotiationException: A call to SSPI failed, see inner exception.

Jun 5, 2017. Now, having said all that, there are always exceptions and a. folder X:_ Marmaladex.xs3edeploypluginsiphonecertificates Rename the.

else { // Display the last error. Console.WriteLine("An error occurred: {0}", crmSvc.LastCrmError); // Display the last exception message if any. Console.WriteLine(crmSvc.LastCrmException.Message);.

Error 5550 On Oe For Mac See customer reviews and comparisons for the HP ENVY 5540 All-in-One Printer. Windows 10, XP SP3 or higher (32-bit only), Vista, 7,8, 8.1; Mac OS X Lion, Painter X Error With the end in sight, it was now time to get the truck back to LGE-CTS Motorsports in San Dimas, California (which handled several portions
Error While Trying To Run The Project Visual Studio This project was working fine, then I restarted my computer to install a new GPU, and now it is producing the following error when I try to run it: Error while trying. Error 5550 On Oe For Mac See customer reviews and comparisons for the HP ENVY 5540 All-in-One Printer. Windows 10, XP SP3 or

“Oakland has little margin for error at this point.” The district is still reeling. but spent $22.3 million. The exception to that trend was in the category of books.

How To Fix Error Exception Occured In S3e_deploy – error exception occured in s3e_deploy. Any help would be appreciated. Warning 1 temporary folder already exists (c:\Marmalade\Projects\b2b\build_bumper2bumper_vc11xwp.

Can't deploy my "Hello World" app in Xamarin. See full exception on logs for more details. 2>An error occured. See full exception on logs for more details.

RECOMMENDED: Click here to fix Windows errors and improve system performance