Fatal Error Pyconfig.h No Such File Or Directory

RECOMMENDED: If you have Windows errors then we strongly recommend that you download and run this (Windows) Repair Tool.

Am 01.09.2017 um 22:32 schrieb Stephen Boyd: > On 08/25, Andreas Färber wrote: >> It fails to build once we introduce the ARCH_MB86S7X Kconfig symbol: >> drivers/clk/clk-mb86s7x.c:27:10: fatal error: soc/mb86s7x/scb_mhu.h: No.

Pushing/pulling from within RStudio, however, threw an error: ssh_askpass: exec(/usr/X11R6/bin/ssh-askpass): No such file or directory Permission denied.

src/lxml/lxml.etree.c:8:22: fatal error: pyconfig.h: No such file or directory. fatal error: pyconfig.h: No such file or directory compilation terminated.

Do you want to receive Linux related questions & answers published at Ask Xmodulo? Enter your email address below, and we will deliver our Linux Q&A straight to your email box, for free. Delivery powered by Google Feedburner.

. openssl/opensslv.h: No such file or directory" compiling. fatal error: openssl/opensslv.h: No such file or. openssl/opensslv.h: No such file or directory.

All files to build this example can be found in the Shocksolution_Examples repo on GitHub. Save the. fatal error: pyconfig.h: No such file or directory # include.

python – Cannot open include file: ‘io.h’ when trying to. – I get the following error when I try to install flask-bcrypt. I am using Windows and Python 2.7. How do I fix this error and get it installed? Searching for flask.

fatal error: epan/packet.h: No such file or directory compilation terminated. Since the epan/packet.h file is available in the certain folder, although it could not find. it gives error. my question is regarding this scenerio. is one such specific.

caffe – Caffe: a fast open framework for deep learning.

Ubuntu – Linking boost.python – Fatal error: pyconfig cannot be found. Ask Question. fatal error: pyconfig.h: No such file or directory # include <pyconfig.h>

Yum Errno 4 Ioerror Urlopen Error 111 I get the ‘urlopen error unknown url type: media’ error with yum: —> Downloading header for jakarta-commons-logging to pack into transaction set. media://1161131669.029329%232/Fedora/RPMS/jakarta-commons-logging-1.0.4. Kenmore Elite Dryer Error Code F40 The F40 error code indicate that you have a problem. Hello, when the F40 code comes up on this machine first check the thermal fuse on

cl.exe @C:UsersEhsanAppDataLocalTempnm4DF1.tmp cl : Command line warning D9002 : ignoring unknown option ‘/G5’ base64.c c:openvpn-2.1_rc7config-win32.h(38) : fatal error C1083: Cannot open include file: ‘autodefs/defs.h’:.

Aug 1, 2010. Bug 620274 – pyconfig-32.h is missing, anaconda fails. unable to open /usr/ include/python2.7/pyconfig-64.h (No such file or directory) install.

Due to the nature of a program I am making, I decided to attempt to embed python into it. So I downloaded the python source code, and linked the includes and libs. I.

Oct 28, 2012. src/MD2.c:31:20: fatal error: Python.h: No such file or directory. compilation terminated. error: command 'gcc' failed with exit status 1. Where can.

python – Fatal error: pyconfig.h: No such file or directory. – Due to the nature of a program I am making, I decided to attempt to embed python into it. So I downloaded the python source code, and linked the includes and libs. I.

Wireshark – fatal error: epan/packet.h: No such file or directory compilation terminated. Since the epan/packet.h file is available in the certain folder, although it could not find. it gives error. my question is regarding this scenerio. is one such specific.

can i use this file as a reference genome for Tophat since they have mentioned that word as Variant ?? please check the link given bellow:.

2017年1月6日. –compile" failed with error code 1 in /tmp/pip-build-AClS41/cryptography/. 前文 是. fatal error: pyconfig.h: No such file or directory # include.

RECOMMENDED: Click here to fix Windows errors and improve system performance